Форум русскоязычного сообщества Ubuntu


Хотите сделать посильный вклад в развитие Ubuntu и русскоязычного сообщества?
Помогите нам с документацией!

Автор Тема: Acer 2920z: как заставить работать wifi и bluetooth?  (Прочитано 2153 раз)

0 Пользователей и 1 Гость просматривают эту тему.

Оффлайн dimkinGnu

  • Автор темы
  • Новичок
  • *
  • Сообщений: 12
    • Просмотр профиля
Пытался установить драйвер для wifi по инструкции:
http://amoralez.ru/2008/01/23/ustanovka-wifi-drajverov-dlya-atheros-50065007eg-ubuntu/

п.2: выясняется, что в ubuntu patch по умолчанию не установлена.
- установили, пропатчили

п.3: пытаемся делать make madwifi

$ make
Checking requirements... ok.
Checking kernel configuration... ok.
make -C /lib/modules/2.6.22-14-generic/build SUBDIRS=/home/dimkin/Soft/madwifi-ng-r2756-20071018 modules
make[1]: Entering directory `/usr/src/linux-headers-2.6.22-14-generic'
  CC [M]  /home/dimkin/Soft/madwifi-ng-r2756-20071018/ath/if_ath.o
  CC [M]  /home/dimkin/Soft/madwifi-ng-r2756-20071018/ath/if_ath_pci.o
  LD [M]  /home/dimkin/Soft/madwifi-ng-r2756-20071018/ath/ath_pci.o
  CC [M]  /home/dimkin/Soft/madwifi-ng-r2756-20071018/ath_hal/ah_os.o
  HOSTCC  /home/dimkin/Soft/madwifi-ng-r2756-20071018/ath_hal/uudecode
/home/dimkin/Soft/madwifi-ng-r2756-20071018/ath_hal/uudecode.c:26:19: error: stdio.h: No such file or directory
/home/dimkin/Soft/madwifi-ng-r2756-20071018/ath_hal/uudecode.c:27:19: error: errno.h: No such file or directory
/home/dimkin/Soft/madwifi-ng-r2756-20071018/ath_hal/uudecode.c:28:20: error: getopt.h: No such file or directory
/home/dimkin/Soft/madwifi-ng-r2756-20071018/ath_hal/uudecode.c:29:20: error: string.h: No such file or directory
/home/dimkin/Soft/madwifi-ng-r2756-20071018/ath_hal/uudecode.c:30:20: error: stdlib.h: No such file or directory
/home/dimkin/Soft/madwifi-ng-r2756-20071018/ath_hal/uudecode.c:32:23: error: sys/fcntl.h: No such file or directory
/home/dimkin/Soft/madwifi-ng-r2756-20071018/ath_hal/uudecode.c:33:22: error: sys/stat.h: No such file or directory
/home/dimkin/Soft/madwifi-ng-r2756-20071018/ath_hal/uudecode.c: In function 'uudecode_usage':
/home/dimkin/Soft/madwifi-ng-r2756-20071018/ath_hal/uudecode.c:37: warning: implicit declaration of function 'printf'
/home/dimkin/Soft/madwifi-ng-r2756-20071018/ath_hal/uudecode.c:37: warning: incompatible implicit declaration of built-in function 'printf'
/home/dimkin/Soft/madwifi-ng-r2756-20071018/ath_hal/uudecode.c: At top level:
/home/dimkin/Soft/madwifi-ng-r2756-20071018/ath_hal/uudecode.c:40: error: expected ')' before '*' token
/home/dimkin/Soft/madwifi-ng-r2756-20071018/ath_hal/uudecode.c:70: error: expected ')' before '*' token
/home/dimkin/Soft/madwifi-ng-r2756-20071018/ath_hal/uudecode.c: In function 'main':
/home/dimkin/Soft/madwifi-ng-r2756-20071018/ath_hal/uudecode.c:121: error: 'FILE' undeclared (first use in this function)
/home/dimkin/Soft/madwifi-ng-r2756-20071018/ath_hal/uudecode.c:121: error: (Each undeclared identifier is reported only once
/home/dimkin/Soft/madwifi-ng-r2756-20071018/ath_hal/uudecode.c:121: error: for each function it appears in.)
/home/dimkin/Soft/madwifi-ng-r2756-20071018/ath_hal/uudecode.c:121: error: 'src_stream' undeclared (first use in this function)
/home/dimkin/Soft/madwifi-ng-r2756-20071018/ath_hal/uudecode.c:122: error: 'dst_stream' undeclared (first use in this function)
/home/dimkin/Soft/madwifi-ng-r2756-20071018/ath_hal/uudecode.c:122: error: 'NULL' undeclared (first use in this function)
/home/dimkin/Soft/madwifi-ng-r2756-20071018/ath_hal/uudecode.c:130: warning: implicit declaration of function 'getopt'
/home/dimkin/Soft/madwifi-ng-r2756-20071018/ath_hal/uudecode.c:134: error: 'optarg' undeclared (first use in this function)
/home/dimkin/Soft/madwifi-ng-r2756-20071018/ath_hal/uudecode.c:138: warning: implicit declaration of function 'exit'
/home/dimkin/Soft/madwifi-ng-r2756-20071018/ath_hal/uudecode.c:138: warning: incompatible implicit declaration of built-in function 'exit'
/home/dimkin/Soft/madwifi-ng-r2756-20071018/ath_hal/uudecode.c:141: error: 'optind' undeclared (first use in this function)
/home/dimkin/Soft/madwifi-ng-r2756-20071018/ath_hal/uudecode.c:142: error: 'stdin' undeclared (first use in this function)
/home/dimkin/Soft/madwifi-ng-r2756-20071018/ath_hal/uudecode.c:144: warning: implicit declaration of function 'fopen'
/home/dimkin/Soft/madwifi-ng-r2756-20071018/ath_hal/uudecode.c:146: warning: implicit declaration of function 'fprintf'
/home/dimkin/Soft/madwifi-ng-r2756-20071018/ath_hal/uudecode.c:146: warning: incompatible implicit declaration of built-in function 'fprintf'
/home/dimkin/Soft/madwifi-ng-r2756-20071018/ath_hal/uudecode.c:146: error: 'stderr' undeclared (first use in this function)
/home/dimkin/Soft/madwifi-ng-r2756-20071018/ath_hal/uudecode.c:147: warning: implicit declaration of function 'strerror'
/home/dimkin/Soft/madwifi-ng-r2756-20071018/ath_hal/uudecode.c:147: error: 'errno' undeclared (first use in this function)
/home/dimkin/Soft/madwifi-ng-r2756-20071018/ath_hal/uudecode.c:147: warning: format '%s' expects type 'char *', but argument 4 has type 'int'
/home/dimkin/Soft/madwifi-ng-r2756-20071018/ath_hal/uudecode.c:148: warning: incompatible implicit declaration of built-in function 'exit'
/home/dimkin/Soft/madwifi-ng-r2756-20071018/ath_hal/uudecode.c:152: warning: incompatible implicit declaration of built-in function 'exit'
/home/dimkin/Soft/madwifi-ng-r2756-20071018/ath_hal/uudecode.c:156: warning: implicit declaration of function 'get_line_from_file'
/home/dimkin/Soft/madwifi-ng-r2756-20071018/ath_hal/uudecode.c:156: warning: assignment makes pointer from integer without a cast
/home/dimkin/Soft/madwifi-ng-r2756-20071018/ath_hal/uudecode.c:157: warning: implicit declaration of function 'strncmp'
/home/dimkin/Soft/madwifi-ng-r2756-20071018/ath_hal/uudecode.c:164: warning: incompatible implicit declaration of built-in function 'fprintf'
/home/dimkin/Soft/madwifi-ng-r2756-20071018/ath_hal/uudecode.c:165: warning: incompatible implicit declaration of built-in function 'exit'
/home/dimkin/Soft/madwifi-ng-r2756-20071018/ath_hal/uudecode.c:168: warning: implicit declaration of function 'strtoul'
/home/dimkin/Soft/madwifi-ng-r2756-20071018/ath_hal/uudecode.c:170: warning: implicit declaration of function 'strchr'
/home/dimkin/Soft/madwifi-ng-r2756-20071018/ath_hal/uudecode.c:170: warning: incompatible implicit declaration of built-in function 'strchr'
/home/dimkin/Soft/madwifi-ng-r2756-20071018/ath_hal/uudecode.c:172: warning: incompatible implicit declaration of built-in function 'fprintf'
/home/dimkin/Soft/madwifi-ng-r2756-20071018/ath_hal/uudecode.c:173: warning: incompatible implicit declaration of built-in function 'exit'
/home/dimkin/Soft/madwifi-ng-r2756-20071018/ath_hal/uudecode.c:178: warning: implicit declaration of function 'strcmp'
/home/dimkin/Soft/madwifi-ng-r2756-20071018/ath_hal/uudecode.c:179: error: 'stdout' undeclared (first use in this function)
/home/dimkin/Soft/madwifi-ng-r2756-20071018/ath_hal/uudecode.c:182: error: 'O_WRONLY' undeclared (first use in this function)
/home/dimkin/Soft/madwifi-ng-r2756-20071018/ath_hal/uudecode.c:182: error: 'O_CREAT' undeclared (first use in this function)
/home/dimkin/Soft/madwifi-ng-r2756-20071018/ath_hal/uudecode.c:182: error: 'O_TRUNC' undeclared (first use in this function)
/home/dimkin/Soft/madwifi-ng-r2756-20071018/ath_hal/uudecode.c:186: error: 'O_EXCL' undeclared (first use in this function)
/home/dimkin/Soft/madwifi-ng-r2756-20071018/ath_hal/uudecode.c:188: warning: implicit declaration of function 'open'
/home/dimkin/Soft/madwifi-ng-r2756-20071018/ath_hal/uudecode.c:189: error: 'S_IRWXU' undeclared (first use in this function)
/home/dimkin/Soft/madwifi-ng-r2756-20071018/ath_hal/uudecode.c:189: error: 'S_IRWXG' undeclared (first use in this function)
/home/dimkin/Soft/madwifi-ng-r2756-20071018/ath_hal/uudecode.c:189: error: 'S_IRWXO' undeclared (first use in this function)
/home/dimkin/Soft/madwifi-ng-r2756-20071018/ath_hal/uudecode.c:191: warning: implicit declaration of function 'fdopen'
/home/dimkin/Soft/madwifi-ng-r2756-20071018/ath_hal/uudecode.c:193: warning: incompatible implicit declaration of built-in function 'fprintf'
/home/dimkin/Soft/madwifi-ng-r2756-20071018/ath_hal/uudecode.c:194: warning: format '%s' expects type 'char *', but argument 4 has type 'int'
/home/dimkin/Soft/madwifi-ng-r2756-20071018/ath_hal/uudecode.c:195: warning: incompatible implicit declaration of built-in function 'exit'
/home/dimkin/Soft/madwifi-ng-r2756-20071018/ath_hal/uudecode.c:199: warning: implicit declaration of function 'read_stduu'
/home/dimkin/Soft/madwifi-ng-r2756-20071018/ath_hal/uudecode.c:201: warning: implicit declaration of function 'fclose'
make[3]: *** [/home/dimkin/Soft/madwifi-ng-r2756-20071018/ath_hal/uudecode] Error 1
make[2]: *** [/home/dimkin/Soft/madwifi-ng-r2756-20071018/ath_hal] Error 2
make[1]: *** [_module_/home/dimkin/Soft/madwifi-ng-r2756-20071018] Error 2
make[1]: Leaving directory `/usr/src/linux-headers-2.6.22-14-generic'
make: *** [modules] Error 2


Подскажите, что ему не нравится и как это исправить?

***

Bluetooth
:

Поддерживается, даже обнаруживается телефон (SonyEricsson K550i), но... при попытке спаривания выдается сообщение:

obex://[00:1a:75:e3:ae:70]" is not a valid location.
Please check the spelling and try again.


Как решить проблему?

Оффлайн 12d3

  • Активист
  • *
  • Сообщений: 674
  • Ubuntu 10.04
    • Просмотр профиля
поставить build-essential

Оффлайн maniak

  • Активист
  • *
  • Сообщений: 489
    • Просмотр профиля
madwifi
Не страдайте фигней.
У меня на аналогичном ноуте wi-fi с виндовыми дровами отлично работает.
Пошаговое описание установки можете найти на этом форуме, в разделе "HowTo".

Оффлайн chain

  • Старожил
  • *
  • Сообщений: 1263
    • Просмотр профиля
угу, wifi ставить ndiswrapper
а для работы bluetooth
sudo apt-get install gnome-vfs-obexftp
-вечный чайник-

Оффлайн dimkinGnu

  • Автор темы
  • Новичок
  • *
  • Сообщений: 12
    • Просмотр профиля
для работы bluetooth
sudo apt-get install gnome-vfs-obexftp

E: Не удалось найти пакет gnome-obexftp

Оффлайн dimkinGnu

  • Автор темы
  • Новичок
  • *
  • Сообщений: 12
    • Просмотр профиля
поставить build-essential

Напиши, пожалуйста, где почитать об этом.

* Всё ок, поставил =)

** В списке Connections по-прежнему нет Wireless -((
только Wired  и  Modem
« Последнее редактирование: 20 Март 2008, 22:47:03 от dimkinGnu »

Оффлайн dimkinGnu

  • Автор темы
  • Новичок
  • *
  • Сообщений: 12
    • Просмотр профиля
madwifi
У меня на аналогичном ноуте wi-fi с виндовыми дровами отлично работает.
Пошаговое описание установки можете найти на этом форуме, в разделе "HowTo".

Можно точнее, плиз?  :)

Оффлайн chain

  • Старожил
  • *
  • Сообщений: 1263
    • Просмотр профиля
для работы bluetooth
sudo apt-get install gnome-vfs-obexftp

E: Не удалось найти пакет gnome-obexftp
gnome-vfs-obexftp
и поставь уже дрова от производителя через ndiswrapper
https://forum.ubuntu.ru/index.php?topic=22467.0
« Последнее редактирование: 20 Март 2008, 22:57:01 от chain »
-вечный чайник-

Оффлайн senek

  • Новичок
  • *
  • Сообщений: 1
    • Просмотр профиля
А у меня почему то bluetooth ноутбука не распознал.(хотя модел таже aspire 2920z) Когда я пытаюсь делать слудующее:
~$ hcitool inq
Inquiring ...
Inquiry failed.: No such device

как поставить драйвер для bluetooth  и где его найти?

 

Страница сгенерирована за 0.057 секунд. Запросов: 23.