Форум русскоязычного сообщества Ubuntu


Автор Тема: PiTiVi 0.91 ошибка при установке  (Прочитано 793 раз)

0 Пользователей и 1 Гость просматривают эту тему.

Оффлайн Omengh

  • Автор темы
  • Новичок
  • *
  • Сообщений: 23
    • Просмотр профиля
PiTiVi 0.91 ошибка при установке
« : 07 Октябрь 2013, 20:31:31 »
После команды "make" вот такая ошибка:

renderer.c:4:42: fatal error: /usr/include/pycairo/pycairo.h: No such file or directory
compilation terminated.

Не могу понять, чего не хватает.

Оффлайн prokoudine

  • Заслуженный пользователь
  • Активист
  • *
  • Сообщений: 497
    • Просмотр профиля
    • Мультимедиа в Linux
Re: PiTiVi 0.91 ошибка при установке
« Ответ #1 : 09 Октябрь 2013, 23:53:57 »
После команды "make" вот такая ошибка:

renderer.c:4:42: fatal error: /usr/include/pycairo/pycairo.h: No such file or directory
compilation terminated.

Не могу понять, чего не хватает.

$ apt-cache search cairo | grep py

Оффлайн Omengh

  • Автор темы
  • Новичок
  • *
  • Сообщений: 23
    • Просмотр профиля
Re: PiTiVi 0.91 ошибка при установке
« Ответ #2 : 12 Октябрь 2013, 22:55:23 »
После команды "make" вот такая ошибка:

renderer.c:4:42: fatal error: /usr/include/pycairo/pycairo.h: No such file or directory
compilation terminated.

Не могу понять, чего не хватает.

$ apt-cache search cairo | grep py

Спасибо, помогла установка пакета "python-cairo-dev"

 

Страница сгенерирована за 0.079 секунд. Запросов: 25.