Форум русскоязычного сообщества Ubuntu


Получить помощь и пообщаться с другими пользователями Ubuntu можно
на irc канале #ubuntu-ru в сети Freenode
и в Jabber конференции ubuntu@conference.jabber.ru

Автор Тема: Ошибка при сборке mysql-connector-c-6.1.3  (Прочитано 810 раз)

0 Пользователей и 1 Гость просматривают эту тему.

Оффлайн tiprocop

  • Автор темы
  • Новичок
  • *
  • Сообщений: 3
    • Просмотр профиля
[ 90%] Built target mysys_ssl
Scanning dependencies of target GenError
[ 90%] Generating ../include/mysqld_error.h, ../sql/share/english/errmsg.sys
/bin/sh: 1: comp_err: not found
make[2]: *** [include/mysqld_error.h] Ошибка 127
make[1]: *** [extra/CMakeFiles/GenError.dir/all] Ошибка 2
make: *** [all] Ошибка 2
это связано с отсутствием comp_err?

Оффлайн hon

  • Старожил
  • *
  • Сообщений: 1044
  • Ubuntu 12.04 LTS
    • Просмотр профиля
Re: Ошибка при сборке mysql-connector-c-6.1.3
« Ответ #1 : 15 Июнь 2014, 12:35:34 »
Вероятно, да.

Оффлайн tiprocop

  • Автор темы
  • Новичок
  • *
  • Сообщений: 3
    • Просмотр профиля
Re: Ошибка при сборке mysql-connector-c-6.1.3
« Ответ #2 : 15 Июнь 2014, 13:24:18 »
И что это вообще за штука такая
comp_err?

 

Страница сгенерирована за 0.082 секунд. Запросов: 25.