Форум русскоязычного сообщества Ubuntu


Автор Тема: Ubuntu 9.10 & Logitech QuickCam for Notebook  (Прочитано 1077 раз)

0 Пользователей и 1 Гость просматривают эту тему.

Оффлайн roka

  • Автор темы
  • Новичок
  • *
  • Сообщений: 25
    • Просмотр профиля
Ubuntu 9.10 & Logitech QuickCam for Notebook
« : 05 Ноябрь 2009, 10:39:59 »
Добрый день!
Странно как-то работает данная связка.
Подсоединяю камеру к ноуту, моментально все подцепляется и работает, а вот если оставить  камеру подключенной к USB и выключить комп, то после включения камеры нет в системе. Передернув шнурок камеры из разъема USB туда обратно, опять все прекрасно работает.
Как сделать так, чтобы камера работала без передергивания после включения?

Оффлайн roka

  • Автор темы
  • Новичок
  • *
  • Сообщений: 25
    • Просмотр профиля
Re: Ubuntu 9.10 & Logitech QuickCam for Notebook
« Ответ #1 : 03 Декабрь 2009, 11:24:49 »
млин, обнаружил такую же проблему и с подключенным по USB принтером. Если шнурок от принтера был подключен до включения ноута, то принтер отказывается печатать, если шнурок передернуть все сразу работает прекрасно. Не хочу постоянно передергивать шнурки, выручайте.

Оффлайн sign777

  • Новичок
  • *
  • Сообщений: 20
    • Просмотр профиля
Re: Ubuntu 9.10 & Logitech QuickCam for Notebook
« Ответ #2 : 09 Февраль 2010, 11:59:29 »
Вопрос.
А что-нибудь дополнительно ставилось или камера заработала сразу без дополнительных драйверов и танцев с бубном?
А то у меня на работе ест такая же, хочу притащить домой и к ноуту с Ubuntu 9.10 подключить и в Скайпе испытать ее.
Заранее спасибо за ответ...

Оффлайн perat

  • Новичок
  • *
  • Сообщений: 29
    • Просмотр профиля
Re: Ubuntu 9.10 & Logitech QuickCam for Notebook
« Ответ #3 : 27 Февраль 2010, 00:46:42 »
скачал драйвер. Никак не могу поставить :(

~/distr/webcam/gspcav1-20071224$sudo ./gspca_build

 REMOVE the old module if present
ERROR: Module gspca does not exist in /proc/modules

 CLEAN gspca source tree
rm -r -f *.o decoder/.gspcadecoder.o.cmd decoder/*.o \
.gspca.o.cmd  *.o *.ko *.mod.* .[a-z]* core *.i \
*.symvers *.err

 COMPILE gspca Please Wait ....!!

 INSTALL gspca in the kernel binary tree
mkdir -p /lib/modules/`uname -r`/kernel/drivers/usb/media/
rm -f /lib/modules/`uname -r`/kernel/drivers/usb/media/spca5xx.ko
rm -f /lib/modules/`uname -r`/kernel/drivers/media/video/gspca.ko
install -c -m 0644 gspca.ko /lib/modules/`uname -r`/kernel/drivers/usb/media/
install: невозможно выполнить stat для `gspca.ko': No such file or directory
make: *** [install] Ошибка 1

 LOAD gspca in memory
FATAL: Module gspca not found.

 PRINT COMPILATION MESSAGES if ERRORS look kgspca.err
make -C /lib/modules/`uname -r`/build SUBDIRS=/home/taras/distr/webcam/gspcav1-20071224 CC=cc modules
make[1]: Вход в каталог `/usr/src/linux-headers-2.6.31-19-generic'
  CC [M]  /home/taras/distr/webcam/gspcav1-20071224/gspca_core.o
/home/taras/distr/webcam/gspcav1-20071224/gspca_core.c:54:27: error: asm/semaphore.h: No such file or directory
In file included from /home/taras/distr/webcam/gspcav1-20071224/gspca_core.c:845:
/home/taras/distr/webcam/gspcav1-20071224/utils/spcausb.h: In function ‘spca5xxRegRead’:
/home/taras/distr/webcam/gspcav1-20071224/utils/spcausb.h:95: error: implicit declaration of function ‘info’
/home/taras/distr/webcam/gspcav1-20071224/utils/spcausb.h: In function ‘spca_set_interface’:
/home/taras/distr/webcam/gspcav1-20071224/utils/spcausb.h:278: error: implicit declaration of function ‘warn’
In file included from /home/taras/distr/webcam/gspcav1-20071224/gspca_core.c:853:
/home/taras/distr/webcam/gspcav1-20071224/Sunplus-jpeg/sp5xxfw2.h: In function ‘sp5xxfw2_init’:
/home/taras/distr/webcam/gspcav1-20071224/Sunplus-jpeg/sp5xxfw2.h:122: error: called object ‘info’ is not a function
/home/taras/distr/webcam/gspcav1-20071224/Sunplus-jpeg/sp5xxfw2.h:136: error: called object ‘info’ is not a function
/home/taras/distr/webcam/gspcav1-20071224/Sunplus-jpeg/sp5xxfw2.h:141: error: called object ‘info’ is not a function
/home/taras/distr/webcam/gspcav1-20071224/Sunplus-jpeg/sp5xxfw2.h:148: error: called object ‘info’ is not a function
/home/taras/distr/webcam/gspcav1-20071224/Sunplus-jpeg/sp5xxfw2.h:176: error: called object ‘info’ is not a function
/home/taras/distr/webcam/gspcav1-20071224/Sunplus-jpeg/sp5xxfw2.h: In function ‘sp5xxfw2_start’:
/home/taras/distr/webcam/gspcav1-20071224/Sunplus-jpeg/sp5xxfw2.h:214: error: called object ‘info’ is not a function
/home/taras/distr/webcam/gspcav1-20071224/Sunplus-jpeg/sp5xxfw2.h:230: error: called object ‘info’ is not a function
/home/taras/distr/webcam/gspcav1-20071224/gspca_core.c: In function ‘spca5xx_ioctl’:
/home/taras/distr/webcam/gspcav1-20071224/gspca_core.c:2463: error: implicit declaration of function ‘video_usercopy’
/home/taras/distr/webcam/gspcav1-20071224/gspca_core.c: At top level:
/home/taras/distr/webcam/gspcav1-20071224/gspca_core.c:2604: error: ‘v4l_compat_ioctl32’ undeclared here (not in a function)
/home/taras/distr/webcam/gspcav1-20071224/gspca_core.c:2609: error: unknown field ‘owner’ specified in initializer
/home/taras/distr/webcam/gspcav1-20071224/gspca_core.c:2609: warning: initialization from incompatible pointer type
/home/taras/distr/webcam/gspcav1-20071224/gspca_core.c:2611: error: unknown field ‘type’ specified in initializer
/home/taras/distr/webcam/gspcav1-20071224/gspca_core.c:2615: warning: initialization from incompatible pointer type
/home/taras/distr/webcam/gspcav1-20071224/gspca_core.c: In function ‘spca50x_create_sysfs’:
/home/taras/distr/webcam/gspcav1-20071224/gspca_core.c:2769: error: implicit declaration of function ‘video_device_create_file’
/home/taras/distr/webcam/gspcav1-20071224/gspca_core.c:2780: error: implicit declaration of function ‘video_device_remove_file’
/home/taras/distr/webcam/gspcav1-20071224/gspca_core.c: In function ‘spca5xx_probe’:
/home/taras/distr/webcam/gspcav1-20071224/gspca_core.c:4301: error: incompatible types when assigning to type ‘struct device’ from type ‘struct device *’
make[2]: *** [/home/taras/distr/webcam/gspcav1-20071224/gspca_core.o] Ошибка 1
make[1]: *** [_module_/home/taras/distr/webcam/gspcav1-20071224] Ошибка 2
make[1]: Выход из каталога `/usr/src/linux-headers-2.6.31-19-generic'
make: *** [default] Ошибка 2
~/distr/webcam/gspcav1-20071224$sudo ./gspca_build

 REMOVE the old module if present
ERROR: Module gspca does not exist in /proc/modules

 CLEAN gspca source tree
rm -r -f *.o decoder/.gspcadecoder.o.cmd decoder/*.o \
.gspca.o.cmd  *.o *.ko *.mod.* .[a-z]* core *.i \
*.symvers *.err

 COMPILE gspca Please Wait ....!!

 INSTALL gspca in the kernel binary tree
mkdir -p /lib/modules/`uname -r`/kernel/drivers/usb/media/
rm -f /lib/modules/`uname -r`/kernel/drivers/usb/media/spca5xx.ko
rm -f /lib/modules/`uname -r`/kernel/drivers/media/video/gspca.ko
install -c -m 0644 gspca.ko /lib/modules/`uname -r`/kernel/drivers/usb/media/
install: невозможно выполнить stat для `gspca.ko': No such file or directory
make: *** [install] Ошибка 1

 LOAD gspca in memory
FATAL: Module gspca not found.

 PRINT COMPILATION MESSAGES if ERRORS look kgspca.err
make -C /lib/modules/`uname -r`/build SUBDIRS=/home/taras/distr/webcam/gspcav1-20071224 CC=cc modules
make[1]: Вход в каталог `/usr/src/linux-headers-2.6.31-19-generic'
  CC [M]  /home/taras/distr/webcam/gspcav1-20071224/gspca_core.o
/home/taras/distr/webcam/gspcav1-20071224/gspca_core.c:54:27: error: asm/semaphore.h: No such file or directory
In file included from /home/taras/distr/webcam/gspcav1-20071224/gspca_core.c:845:
/home/taras/distr/webcam/gspcav1-20071224/utils/spcausb.h: In function ‘spca5xxRegRead’:
/home/taras/distr/webcam/gspcav1-20071224/utils/spcausb.h:95: error: implicit declaration of function ‘info’
/home/taras/distr/webcam/gspcav1-20071224/utils/spcausb.h: In function ‘spca_set_interface’:
/home/taras/distr/webcam/gspcav1-20071224/utils/spcausb.h:278: error: implicit declaration of function ‘warn’
In file included from /home/taras/distr/webcam/gspcav1-20071224/gspca_core.c:853:
/home/taras/distr/webcam/gspcav1-20071224/Sunplus-jpeg/sp5xxfw2.h: In function ‘sp5xxfw2_init’:
/home/taras/distr/webcam/gspcav1-20071224/Sunplus-jpeg/sp5xxfw2.h:122: error: called object ‘info’ is not a function
/home/taras/distr/webcam/gspcav1-20071224/Sunplus-jpeg/sp5xxfw2.h:136: error: called object ‘info’ is not a function
/home/taras/distr/webcam/gspcav1-20071224/Sunplus-jpeg/sp5xxfw2.h:141: error: called object ‘info’ is not a function
/home/taras/distr/webcam/gspcav1-20071224/Sunplus-jpeg/sp5xxfw2.h:148: error: called object ‘info’ is not a function
/home/taras/distr/webcam/gspcav1-20071224/Sunplus-jpeg/sp5xxfw2.h:176: error: called object ‘info’ is not a function
/home/taras/distr/webcam/gspcav1-20071224/Sunplus-jpeg/sp5xxfw2.h: In function ‘sp5xxfw2_start’:
/home/taras/distr/webcam/gspcav1-20071224/Sunplus-jpeg/sp5xxfw2.h:214: error: called object ‘info’ is not a function
/home/taras/distr/webcam/gspcav1-20071224/Sunplus-jpeg/sp5xxfw2.h:230: error: called object ‘info’ is not a function
/home/taras/distr/webcam/gspcav1-20071224/gspca_core.c: In function ‘spca5xx_ioctl’:
/home/taras/distr/webcam/gspcav1-20071224/gspca_core.c:2463: error: implicit declaration of function ‘video_usercopy’
/home/taras/distr/webcam/gspcav1-20071224/gspca_core.c: At top level:
/home/taras/distr/webcam/gspcav1-20071224/gspca_core.c:2604: error: ‘v4l_compat_ioctl32’ undeclared here (not in a function)
/home/taras/distr/webcam/gspcav1-20071224/gspca_core.c:2609: error: unknown field ‘owner’ specified in initializer
/home/taras/distr/webcam/gspcav1-20071224/gspca_core.c:2609: warning: initialization from incompatible pointer type
/home/taras/distr/webcam/gspcav1-20071224/gspca_core.c:2611: error: unknown field ‘type’ specified in initializer
/home/taras/distr/webcam/gspcav1-20071224/gspca_core.c:2615: warning: initialization from incompatible pointer type
/home/taras/distr/webcam/gspcav1-20071224/gspca_core.c: In function ‘spca50x_create_sysfs’:
/home/taras/distr/webcam/gspcav1-20071224/gspca_core.c:2769: error: implicit declaration of function ‘video_device_create_file’
/home/taras/distr/webcam/gspcav1-20071224/gspca_core.c:2780: error: implicit declaration of function ‘video_device_remove_file’
/home/taras/distr/webcam/gspcav1-20071224/gspca_core.c: In function ‘spca5xx_probe’:
/home/taras/distr/webcam/gspcav1-20071224/gspca_core.c:4301: error: incompatible types when assigning to type ‘struct device’ from type ‘struct device *’
make[2]: *** [/home/taras/distr/webcam/gspcav1-20071224/gspca_core.o] Ошибка 1
make[1]: *** [_module_/home/taras/distr/webcam/gspcav1-20071224] Ошибка 2
make[1]: Выход из каталога `/usr/src/linux-headers-2.6.31-19-generic'
make: *** [default] Ошибка 2

Оффлайн y-u-h

  • Любитель
  • *
  • Сообщений: 69
  • linux noob
    • Просмотр профиля
    • TheEnd
Re: Ubuntu 9.10 & Logitech QuickCam for Notebook
« Ответ #4 : 04 Март 2010, 20:19:13 »
здесь http://ubuntuforums.org/showthread.php?t=1015611&page=2  и тут http://sudouser.com/nastrojka-vebkamer-genius-i-acer-crystal-eye-v-ubuntu-804.html частично решена проблема. Я свою, точно такую же, как у perat не решил до сих пор (Genius iSlim300)
« Последнее редактирование: 04 Март 2010, 20:35:57 от y-u-h »
Ubuntu 13.04 LTS x86_64

 

Страница сгенерирована за 0.054 секунд. Запросов: 23.